Target
Beta-lactamase TEM
Ligand
BDBM50021959
Substrate
Meas. Tech.
ChEBML_68033
IC50
60±n/a nM
Citation
 Buynak, JDGeng, BBachmann, BLing, Hua The synthesis and lactamase inhibitory activity of 6-(carboxymethylene)penicillins and 7-(carboxymethylene)cephalosporins Bioorg Med Chem Lett 5:1513-1518 (1995)    Article 
Target
Name:
Beta-lactamase TEM
Synonyms:
BLAT_ECOLX Beta-lactamase (TEM-1) Beta-lactamase TEM-1 Beta-lactamase TEM1D Beta-lactamase TEM1F TEM extended-spectrum beta-lactamase bla
Type:
Enzyme
Mol. Mass.:
31512.33
Organism:
Escherichia coli
Description:
P62593
Residue:
286
  
Inhibitor
Name:
BDBM50021959
Synonyms:
CHEMBL777 US9120808, Clavulanic acid potassium salt clavulanic acid
Type:
Small organic molecule
Emp. Form.:
C8H9NO5
Mol. Mass.:
199.1608
SMILES:
OC\C=C1/O[C@@H]2CC(=O)N2[C@H]1C(O)=O
: