Target
Prolyl endopeptidase
Ligand
BDBM50291164
Substrate
Meas. Tech.
ChEBML_157479
IC50
7800±n/a nM
Citation
 Akiyama, YTsutsumi, SHatsushiba, EOhuchi, SOkonogi, T Peptidyl -keto thiazole as potent thrombin inhibitors Bioorg Med Chem Lett 7:533-538 (1997)    Article 
Target
Name:
Prolyl endopeptidase
Synonyms:
3.4.21.26 PPCE_PIG Post-proline cleaving enzyme
Type:
Mol. Mass.:
80758.04
Organism:
Sus scrofa
Description:
Residue:
710
  
Inhibitor
Name:
BDBM50291164
Synonyms:
(S)-1-(4-Phenyl-butyryl)-pyrrolidine-2-carboxylic acid [(S)-5-amino-1-(thiazole-2-carbonyl)-pentyl]-amide | CHEMBL149924
Type:
Small organic molecule
Emp. Form.:
C24H32N4O3S
Mol. Mass.:
456.601
SMILES:
NCCCC[C@H](NC(=O)[C@@H]1CCCN1C(=O)CCCc1ccccc1)C(=O)c1nccs1
: