Target
Integrin alpha-V/beta-3
Ligand
BDBM50085017
Substrate
Meas. Tech.
ChEMBL_217642 (CHEMBL818514)
IC50
3000±n/a nM
Citation
 Peyman, AWehner, VKnolle, JStilz, HUBreipohl, GScheunemann, KHCarniato, DRuxer, JMGourvest, JFGadek, TRBodary, S RGD mimetics containing a central hydantoin scaffold: alpkha(v)beta3 vs alpha(IIb)beta3 selectivity requirements. Bioorg Med Chem Lett 10:179-82 (2000)  
Target
Name:
Integrin alpha-V/beta-3
Synonyms:
ITGAV/ITGB3 | Integrin beta-3/Vitronectin receptor alpha
Type:
Enzyme
Mol. Mass.:
Description:
Components:
This complex has 2 components.
Component 1
Name:
Integrin alpha-V
Synonyms:
ITAV_HUMAN Integrin alpha-V/alpha-5 VNRA Vitronectin receptor | Vitronectin receptor subunit alpha
Type:
PROTEIN
Mol. Mass.:
116024.92
Organism:
Homo sapiens (Human)
Description:
ChEMBL_582336
Residue:
1048
  
Component 2
Name:
Integrin beta-3
Synonyms:
CD_antigen=CD61 GPIIIa ITGB3 Platelet membrane glycoprotein IIIa
Type:
Protein
Mol. Mass.:
87038.91
Organism:
Homo sapiens (Human)
Description:
P05106
Residue:
788
  
Inhibitor
Name:
BDBM50085017
Synonyms:
2-(3-Benzyl-thioureido)-3-{2-[(S)-4-(3-guanidino-propyl)-2,5-dioxo-imidazolidin-1-yl]-acetylamino}-propionic acid anion
Type:
Small organic molecule
Emp. Form.:
C20H27N8O5S
Mol. Mass.:
491.545
SMILES:
NC(=N)NCCCc1[nH]c(=O)n(CC(=O)NCC(NC(=S)NCc2ccccc2)C([O-])=O)c1O
: