Target
Renin
Ligand
BDBM50006851
Substrate
Meas. Tech.
ChEBML_195741
IC50
0.480000±n/a nM
Citation
 Patt, WCHamilton, HWTaylor, MDRyan, MJTaylor, DGConnolly, CJDoherty, AMKlutchko, SRSircar, ISteinbaugh, BA Structure-activity relationships of a series of 2-amino-4-thiazole-containing renin inhibitors. J Med Chem 35:2562-72 (1992)  
Target
Name:
Renin
Synonyms:
Angiotensinogenase RENI_HUMAN
Type:
Enzyme
Mol. Mass.:
45058.99
Organism:
Homo sapiens (Human)
Description:
Residue:
406
  
Inhibitor
Name:
BDBM50006851
Synonyms:
CHEMBL263531 | N-[1-(1-Cyclohexylmethyl-2,3-dihydroxy-5-methyl-hexylcarbamoyl)-2-phenyl-ethyl]-2-(morpholine-4-sulfonylamino)-3-phenyl-propionamide
Type:
Small organic molecule
Emp. Form.:
C36H54N4O7S
Mol. Mass.:
686.902
SMILES:
CC(C)C[C@H](O)[C@H](O)[C@H](CC1CCCCC1)NC(=O)[C@H](Cc1ccccc1)NC(=O)[C@H](Cc1ccccc1)NS(=O)(=O)N1CCOCC1
: