Target
3-oxo-5-alpha-steroid 4-dehydrogenase 2
Ligand
BDBM50034136
Substrate
Meas. Tech.
ChEMBL_204737 (CHEMBL805430)
IC50
>1000±n/a nM
Citation
 Li, XSingh, SMLabrie, F Synthesis and in vitro activity of 17 beta-(N-alkyl/arylformamido)- and 17 beta-[(N-alkyl/aryl)alkyl/arylamido]-4-methyl-4-aza-3-oxo-5 alpha-androstan-3-ones as inhibitors of human 5 alpha-reductases and antagonists of the androgen receptor. J Med Chem 38:1158-73 (1995)  
Target
Name:
3-oxo-5-alpha-steroid 4-dehydrogenase 2
Synonyms:
3-oxo-5-alpha-steroid 4-dehydrogenase 2 5α-Reductase 2 (5α-R2) SR type 2 Steroid 5-alpha-reductase Type II 5-alpha reductase
Type:
Enzyme
Mol. Mass.:
28406.59
Organism:
Homo sapiens (Human)
Description:
P31213
Residue:
254
  
Inhibitor
Name:
BDBM50034136
Synonyms:
CHEMBL277563 | N-((4aR,6aS,7S,11aR)-4a,6a-Dimethyl-2-oxo-2,4a,4b,5,6,6a,7,8,9,9a,9b,10,11,11a-tetradecahydro-1H-indeno[5,4-f]quinolin-7-yl)-N-methyl-formamide
Type:
Small organic molecule
Emp. Form.:
C20H30N2O2
Mol. Mass.:
330.4644
SMILES:
CN(C=O)[C@H]1CCC2C3CC[C@H]4NC(=O)C=C[C@]4(C)C3CC[C@]12C
: