Target
Prolyl endopeptidase
Ligand
BDBM50206820
Substrate
Meas. Tech.
ChEMBL_454767 (CHEMBL886795)
IC50
>1000000±n/a nM
Citation
 Ahn, JHShin, MSJun, MAJung, SHKang, SKKim, KRRhee, SDKang, NSKim, SYSohn, SKKim, SGJin, MSLee, JOCheon, HGKim, SS Synthesis, biological evaluation and structural determination of beta-aminoacyl-containing cyclic hydrazine derivatives as dipeptidyl peptidase IV (DPP-IV) inhibitors. Bioorg Med Chem Lett 17:2622-8 (2007)  
Target
Name:
Prolyl endopeptidase
Synonyms:
PE POP PREP Prolyl oligopeptidase
Type:
Enzyme
Mol. Mass.:
80688.50
Organism:
Homo sapiens (Human)
Description:
P48147
Residue:
710
  
Inhibitor
Name:
BDBM50206820
Synonyms:
(R)-3-amino-1-(2-benzoyl-1,2-diazepan-1-yl)-4-(2,4,5-trifluorophenyl)butan-1-one hydrochloride | CHEMBL539611
Type:
Small organic molecule
Emp. Form.:
C22H24F3N3O2
Mol. Mass.:
419.4401
SMILES:
N[C@@H](CC(=O)N1CCCCCN1C(=O)c1ccccc1)Cc1cc(F)c(F)cc1F
: