Target
Transcription factor Jun
Ligand
BDBM50295170
Substrate
Meas. Tech.
ChEMBL_573443 (CHEMBL1061338)
IC50
71±n/a nM
Citation
 Beutler, JAKang, MIRobert, FClement, JAPelletier, JColburn, NHMcKee, TCGoncharova, EMcMahon, JBHenrich, CJ Quassinoid inhibition of AP-1 function does not correlate with cytotoxicity or protein synthesis inhibition. J Nat Prod 72:503-6 (2010)  
Target
Name:
Transcription factor Jun
Synonyms:
AP1 JUN Proto-oncogene c-JUN Transcription factor AP1 p39
Type:
Mol. Mass.:
35683.24
Organism:
Homo sapiens (Human)
Description:
P05412
Residue:
331
  
Inhibitor
Name:
BDBM50295170
Synonyms:
6R-senecionylchaparrin | CHEMBL564009
Type:
Small organic molecule
Emp. Form.:
C25H34O9
Mol. Mass.:
478.5321
SMILES:
[#6]-[#6@H]-1-[#6@@H](-[#8])[C@@]2([#8])[#8]-[#6][C@]34[#6@H]2[C@@]2([#6])[#6@H](-[#8])-[#6@@H](-[#8])-[#6]=[#6](-[#6])-[#6@@H]2-[#6@@H](-[#8]-[#6](=O)\[#6]=[#6](\[#6])-[#6])-[#6@H]3-[#8]-[#6](=O)-[#6]-[#6@@H]-14
: