Target
Insulin-like growth factor 1 receptor
Ligand
BDBM50383194
Substrate
Meas. Tech.
ChEMBL_819187 (CHEMBL2032456)
Ki
31±n/a nM
Citation
 Liu, LNorman, MHLee, MXi, NSiegmund, ABoezio, AABooker, SChoquette, DD'Angelo, NDGermain, JYang, KYang, YZhang, YBellon, SFWhittington, DAHarmange, JCDominguez, CKim, TSDussault, I Structure-based design of novel class II c-Met inhibitors: 2. SAR and kinase selectivity profiles of the pyrazolone series. J Med Chem 55:1868-97 (2012)  
Target
Name:
Insulin-like growth factor 1 receptor
Synonyms:
CD_antigen=CD221 IGF1R Insulin-like growth factor 1 receptor (IGF1R) Insulin-like growth factor 1 receptor alpha chain Insulin-like growth factor I receptor | Insulin-like growth factor receptor (IGFR)
Type:
Protein
Mol. Mass.:
154776.79
Organism:
Homo sapiens (Human)
Description:
P08069
Residue:
1367
  
Inhibitor
Name:
BDBM50383194
Synonyms:
CHEMBL2032018
Type:
Small organic molecule
Emp. Form.:
C30H24N6O5
Mol. Mass.:
548.5488
SMILES:
COc1ccc2c(Oc3ccc(NC(=O)c4c(-c5cc(C)on5)n(C)n(-c5ccccc5)c4=O)nc3)ccnc2c1
: