Target
Phosphatidylinositol 4,5-bisphosphate 3-kinase catalytic subunit beta isoform
Ligand
BDBM50389060
Substrate
Meas. Tech.
ChEMBL_833430 (CHEMBL2066371)
IC50
88±n/a nM
Citation
 Certal, VHalley, FVirone-Oddos, ADelorme, CKarlsson, ARak, AThompson, FFiloche-Rommé, BEl-Ahmad, YCarry, JCAbecassis, PYLejeune, PVincent, LBonnevaux, HNicolas, JPBertrand, TMarquette, JPMichot, NBenard, TBelow, PVade, IChatreaux, FLebourg, GPilorge, FAngouillant-Boniface, OLouboutin, ALengauer, CSchio, L Discovery and optimization of new benzimidazole- and benzoxazole-pyrimidone selective PI3Kß inhibitors for the treatment of phosphatase and TENsin homologue (PTEN)-deficient cancers. J Med Chem 55:4788-805 (2012)  
Target
Name:
Phosphatidylinositol 4,5-bisphosphate 3-kinase catalytic subunit beta isoform
Synonyms:
PI3-kinase p110 subunit beta PI3Kbeta PIK3CB Phosphatidylinositol 4,5-bisphosphate 3-kinase catalytic subunit beta (PI3Kbeta) Phosphatidylinositol 4,5-bisphosphate 3-kinase catalytic subunit beta isoform (PI3K) Phosphatidylinositol 4,5-bisphosphate 3-kinase catalytic subunit beta isoform (PI3Kbeta) Phosphatidylinositol-4,5-bisphosphate 3-kinase catalytic subunit beta isoform Phosphoinositide 3-Kinase (PI3K), beta Chain A PtdIns-3-kinase p110
Type:
Enzyme Subunit
Mol. Mass.:
122769.00
Organism:
Homo sapiens (Human)
Description:
P42338
Residue:
1070
  
Inhibitor
Name:
BDBM50389060
Synonyms:
CHEMBL2064354
Type:
Small organic molecule
Emp. Form.:
C16H15FN4O3
Mol. Mass.:
330.3137
SMILES:
Fc1cccc2nc(Cc3nc(cc(=O)[nH]3)N3CCOCC3)oc12
: