Target
Prostaglandin G/H synthase 2
Ligand
BDBM50326129
Substrate
Meas. Tech.
ChEMBL_862693 (CHEMBL2174241)
IC50
39000±n/a nM
Citation
 Arisawa, MKasaya, YObata, TSasaki, TNakamura, TAraki, TYamamoto, KSasaki, AYamano, AIto, MAbe, HIto, YShuto, S Design and synthesis of indomethacin analogues that inhibit P-glycoprotein and/or multidrug resistant protein without COX inhibitory activity. J Med Chem 55:8152-63 (2012)  
Target
Name:
Prostaglandin G/H synthase 2
Synonyms:
COX2 Cyclooxygenase-2 (COX-2) PTGS2 Prostaglandin G/H synthase (cyclooxygenase)
Type:
Protein
Mol. Mass.:
68976.98
Organism:
Ovis aries (Sheep)
Description:
Residue:
603
  
Inhibitor
Name:
BDBM50326129
Synonyms:
Indometacin
Type:
Small organic molecule
Emp. Form.:
C18H14ClNO3
Mol. Mass.:
327.762
SMILES:
Cc1c(CC(O)=O)c2ccccc2n1C(=O)c1ccc(Cl)cc1
: