Target
NAD-dependent protein deacylase sirtuin-5, mitochondrial
Ligand
BDBM50336799
Substrate
Meas. Tech.
ChEMBL_880330 (CHEMBL2209185)
IC50
46600±n/a nM
Citation
 Maurer, BRumpf, TScharfe, MStolfa, DASchmitt, MLHe, WVerdin, ESippl, WJung, M Inhibitors of the NAD(+)-Dependent Protein Desuccinylase and Demalonylase Sirt5. ACS Med Chem Lett 3:1050-1053 (2012)  
Target
Name:
NAD-dependent protein deacylase sirtuin-5, mitochondrial
Synonyms:
NAD-dependent protein deacetylase sirtuin-5 (SIRT5) Regulatory protein SIR2 homolog 5 SIR2L5 SIRT5
Type:
Protein
Mol. Mass.:
33892.62
Organism:
Homo sapiens (Human)
Description:
Q9NXA8
Residue:
310
  
Inhibitor
Name:
BDBM50336799
Synonyms:
5,5',5''-[1,3,6-naphthalenetriyltris(sulfonylimino)]tris[1,3-benzenesulfonate analogue 8,8'-[CARBONYLBIS[IMINO-3,1-PHENYLENECARBONYLIMINO(4-METHYL-3,1-PHENYLENE)CARBONYLIMINO]]BIS-1,3,5-NAPHTHALENETRISULFONIC ACID 8-[(4-methyl-3-{[3-({[3-({2-methyl-5-[(4,6,8-trisulfonaphthalen-1-yl)carbamoyl]phenyl}carbamoyl)phenyl]carbamoyl}amino)benzene]amido}benzene)amido]naphthalene-1,3,5-trisulfonic acid Germanin US8835659, Suramin suramin
Type:
Small organic molecule
Emp. Form.:
C51H40N6O23S6
Mol. Mass.:
1297.28
SMILES:
Cc1ccc(cc1NC(=O)c1cccc(NC(=O)Nc2cccc(c2)C(=O)Nc2cc(ccc2C)C(=O)Nc2ccc(c3cc(cc(c23)S(O)(=O)=O)S(O)(=O)=O)S(O)(=O)=O)c1)C(=O)Nc1ccc(c2cc(cc(c12)S(O)(=O)=O)S(O)(=O)=O)S(O)(=O)=O
: