Target
C-X-C chemokine receptor type 4
Ligand
BDBM50403809
Substrate
Meas. Tech.
ChEBML_102333
EC50
8.3±n/a nM
Citation
 Tamamura, HOmagari, AOishi, SKanamoto, TYamamoto, NPeiper, SCNakashima, HOtaka, AFujii, N Pharmacophore identification of a specific CXCR4 inhibitor, T140, leads to development of effective anti-HIV agents with very high selectivity indexes. Bioorg Med Chem Lett 10:2633-7 (2000)  
Target
Name:
C-X-C chemokine receptor type 4
Synonyms:
C-X-C chemokine receptor type 4 CD_antigen=CD184 CXCR-4 CXCR4_HUMAN Fusin LCR1 Leukocyte-derived seven transmembrane domain receptor SDF-1 receptor | Stromal cell-derived factor 1 receptor
Type:
Enzyme
Mol. Mass.:
39754.61
Organism:
Homo sapiens (Human)
Description:
P61073
Residue:
352
  
Inhibitor
Name:
BDBM50403809
Synonyms:
CHEMBL2370104
Type:
Small organic molecule
Emp. Form.:
C88H140N34O18S2
Mol. Mass.:
2026.4
SMILES:
[H][C@@]12CCCN1C(=O)[C@@H](CCCCN)NC(=O)[C@H](CCCCN)NC(=O)[C@H](CCCN=C(N)N)NC(=O)[C@H](Cc1ccc(O)cc1)NC(=O)[C@H](CSSC[C@H](NC(=O)[C@H](CCCNC(N)=O)NC(=O)[C@H](CCCN=C(N)N)NC(=O)[C@H](Cc1ccc(O)cc1)NC2=O)C(=O)N[C@@H](CCCN=C(N)N)C(O)=O)NC(=O)[C@H](Cc1c[nH]c2ccccc12)NC(=O)[C@H](CCCN=C(N)N)NC(=O)[C@@H](N)CCCN=C(N)N
: