Target
Mitogen-activated protein kinase 11
Ligand
BDBM50421137
Substrate
Meas. Tech.
ChEMBL_839530 (CHEMBL2090337)
IC50
9.3±n/a nM
Citation
 Tynebor, RMChen, MHNatarajan, SRO'Neill, EAThompson, JEFitzgerald, CEO'Keefe, SJDoherty, JB Synthesis and biological activity of pyridopyridazin-6-one p38a MAP kinase inhibitors. Part 2. Bioorg Med Chem Lett 22:5979-83 (2012)  
Target
Name:
Mitogen-activated protein kinase 11
Synonyms:
MAP Kinase p38 beta Mapk11 Mitogen-activated protein kinase p38 beta p38B
Type:
Enzyme
Mol. Mass.:
41390.66
Organism:
Mus musculus (mouse)
Description:
Q9WUI1
Residue:
364
  
Inhibitor
Name:
BDBM50421137
Synonyms:
CHEMBL2088588
Type:
Small organic molecule
Emp. Form.:
C23H16F2N2O5
Mol. Mass.:
438.3803
SMILES:
COC(=O)c1ccc(OC)c(c1)-c1c2ccc(Oc3ccc(F)cc3F)nn2ccc1=O
: