Target
Acetyl-CoA carboxylase 2
Ligand
BDBM50439639
Substrate
Meas. Tech.
ChEMBL_978105 (CHEMBL2422747)
IC50
6.7±n/a nM
Citation
 Griffith, DADow, RLHuard, KEdmonds, DJBagley, SWPolivkova, JZeng, DGarcia-Irizarry, CNSouthers, JAEsler, WAmor, PLoomis, KMcPherson, KBahnck, KBPréville, CBanks, TMoore, DEMathiowetz, AMMenhaji-Klotz, ESmith, ACDoran, SDBeebe, DADunn, MF Spirolactam-based acetyl-CoA carboxylase inhibitors: toward improved metabolic stability of a chromanone lead structure. J Med Chem 56:7110-9 (2013)  
Target
Name:
Acetyl-CoA carboxylase 2
Synonyms:
ACACB ACC-beta ACCB Acetyl-CoA carboxylase 2 Acetyl-CoA carboxylase 2 (ACC2)
Type:
Protein
Mol. Mass.:
276535.21
Organism:
Homo sapiens (Human)
Description:
O00763
Residue:
2458
  
Inhibitor
Name:
BDBM50439639
Synonyms:
CHEMBL2419591 | US8993586, 64
Type:
Small organic molecule
Emp. Form.:
C22H25ClN6O2
Mol. Mass.:
440.926
SMILES:
CC(C)(C)n1cc2CC3(CCN(CC3)C(=O)c3ccc4[nH]nc(Cl)c4c3)NC(=O)c2n1
: