Target
Phosphatidylinositol 4,5-bisphosphate 3-kinase catalytic subunit beta isoform
Ligand
BDBM50447089
Substrate
Meas. Tech.
ChEMBL_1289891 (CHEMBL3119746)
IC50
1±n/a nM
Citation
 Certal, VCarry, JCHalley, FVirone-Oddos, AThompson, FFiloche-Rommé, BEl-Ahmad, YKarlsson, ACharrier, VDelorme, CRak, AAbecassis, PYAmara, CVincent, LBonnevaux, HNicolas, JPMathieu, MBertrand, TMarquette, JPMichot, NBenard, TPerrin, MALemaitre, OGuerif, SPerron, SMonget, SGruss-Leleu, FDoerflinger, GGuizani, HBrollo, MDelbarre, LBertin, LRichepin, PLoyau, VGarcia-Echeverria, CLengauer, CSchio, L Discovery and optimization of pyrimidone indoline amide PI3Kß inhibitors for the treatment of phosphatase and tensin homologue (PTEN)-deficient cancers. J Med Chem 57:903-20 (2014)  
Target
Name:
Phosphatidylinositol 4,5-bisphosphate 3-kinase catalytic subunit beta isoform
Synonyms:
PI3-kinase p110 subunit beta PI3Kbeta PIK3CB Phosphatidylinositol 4,5-bisphosphate 3-kinase catalytic subunit beta (PI3Kbeta) Phosphatidylinositol 4,5-bisphosphate 3-kinase catalytic subunit beta isoform (PI3K) Phosphatidylinositol 4,5-bisphosphate 3-kinase catalytic subunit beta isoform (PI3Kbeta) Phosphatidylinositol-4,5-bisphosphate 3-kinase catalytic subunit beta isoform Phosphoinositide 3-Kinase (PI3K), beta Chain A PtdIns-3-kinase p110
Type:
Enzyme Subunit
Mol. Mass.:
122769.00
Organism:
Homo sapiens (Human)
Description:
P42338
Residue:
1070
  
Inhibitor
Name:
BDBM50447089
Synonyms:
CHEMBL3112849
Type:
Small organic molecule
Emp. Form.:
C18H19ClN4O3
Mol. Mass.:
374.821
SMILES:
Clc1cccc2N(CCc12)C(=O)Cc1nc(cc(=O)[nH]1)N1CCOCC1
: