Target
Phosphatidylinositol 4,5-bisphosphate 3-kinase catalytic subunit alpha isoform
Ligand
BDBM50447100
Substrate
Meas. Tech.
ChEMBL_1289892 (CHEMBL3119747)
IC50
322±n/a nM
Citation
 Certal, VCarry, JCHalley, FVirone-Oddos, AThompson, FFiloche-Rommé, BEl-Ahmad, YKarlsson, ACharrier, VDelorme, CRak, AAbecassis, PYAmara, CVincent, LBonnevaux, HNicolas, JPMathieu, MBertrand, TMarquette, JPMichot, NBenard, TPerrin, MALemaitre, OGuerif, SPerron, SMonget, SGruss-Leleu, FDoerflinger, GGuizani, HBrollo, MDelbarre, LBertin, LRichepin, PLoyau, VGarcia-Echeverria, CLengauer, CSchio, L Discovery and optimization of pyrimidone indoline amide PI3Kß inhibitors for the treatment of phosphatase and tensin homologue (PTEN)-deficient cancers. J Med Chem 57:903-20 (2014)  
Target
Name:
Phosphatidylinositol 4,5-bisphosphate 3-kinase catalytic subunit alpha isoform
Synonyms:
P42336 PI3-kinase subunit p110-alpha PIK3CA Phosphatidylinositol 3-kinase alpha (PI3Kalpha) Phosphatidylinositol 4,5-bisphosphate 3-kinase (PI3K) Phosphatidylinositol 4,5-bisphosphate 3-kinase catalytic subunit alpha (PI3Kalpha) Phosphatidylinositol 4,5-bisphosphate 3-kinase catalytic subunit alpha isoform (PI3-Ka) Phosphatidylinositol 4,5-bisphosphate 3-kinase catalytic subunit alpha isoform (PI3K p110alpha) Phosphatidylinositol 4,5-bisphosphate 3-kinase catalytic subunit alpha isoform (PI3K-alpha) Phosphatidylinositol 4,5-bisphosphate 3-kinase catalytic subunit alpha isoform (PI3Kalpha p110alpha) Phosphatidylinositol 4,5-bisphosphate 3-kinase catalytic subunit alpha isoform (PIK3CA) Phosphatidylinositol-4,5-bisphosphate 3-kinase catalytic subunit alpha isoform Phosphoinositide 3-Kinase (PI3K), alpha Chain A Phosphoinositide 3-kinases (PI3K) PtdIns-3-kinase p110 | p110 alpha
Type:
Enzyme Subunit
Mol. Mass.:
124294.87
Organism:
Homo sapiens (Human)
Description:
P42336
Residue:
1068
  
Inhibitor
Name:
BDBM50447100
Synonyms:
CHEMBL3112862
Type:
Small organic molecule
Emp. Form.:
C19H22N4O3
Mol. Mass.:
354.403
SMILES:
CC1Cc2ccccc2N1C(=O)Cc1nc(cc(=O)[nH]1)N1CCOCC1
: