Target
Oxa40
Ligand
BDBM50447650
Substrate
Meas. Tech.
ChEMBL_1289443 (CHEMBL3117137)
IC50
>50000±n/a nM
Citation
 Blizzard, TAChen, HKim, SWu, JBodner, RGude, CImbriglio, JYoung, KPark, YWOgawa, ARaghoobar, SHairston, NPainter, REWisniewski, DScapin, GFitzgerald, PSharma, NLu, JHa, SHermes, JHammond, ML Discovery of MK-7655, aß-lactamase inhibitor for combination with Primaxin®. Bioorg Med Chem Lett 24:780-5 (2014)  
Target
Name:
Oxa40
Synonyms:
Beta-lactamase | Class D β-lactamase (OXA-24)
Type:
Enzyme
Mol. Mass.:
30946.50
Organism:
Acinetobacter baumannii
Description:
Q8RLA6
Residue:
275
  
Inhibitor
Name:
BDBM50447650
Synonyms:
CHEMBL3112742
Type:
Small organic molecule
Emp. Form.:
C11H18N4O6S
Mol. Mass.:
334.349
SMILES:
OS(=O)(=O)ON1[C@H]2CN([C@@H](CC2)C(=O)N[C@H]2CCNC2)C1=O
: