Target
Phosphatidylinositol 4,5-bisphosphate 3-kinase catalytic subunit gamma isoform
Ligand
BDBM50449308
Substrate
Meas. Tech.
ChEMBL_1295720 (CHEMBL3129532)
IC50
>10000±n/a nM
Citation
 Certal, VHalley, FVirone-Oddos, AFiloche-Rommé, BCarry, JCGruss-Leleu, FBertin, LGuizani, HPilorge, FRichepin, PKarlsson, ACharrier, VAbecassis, PYVincent, LNicolas, JPLengauer, CGarcia-Echeverria, CSchio, L Preparation and optimization of new 4-(2-(indolin-1-yl)-2-oxoethyl)-2-morpholinothiazole-5-carboxylic acid and amide derivatives as potent and selective PI3Kß inhibitors. Bioorg Med Chem Lett 24:1506-10 (2014)  
Target
Name:
Phosphatidylinositol 4,5-bisphosphate 3-kinase catalytic subunit gamma isoform
Synonyms:
PI3-kinase p110 subunit gamma PI3Kgamma PK3CG_HUMAN Phosphatidylinositol 4,5-bisphosphate 3-kinase (PI3K) Phosphatidylinositol 4,5-bisphosphate 3-kinase catalytic subunit gamma (PI3Kgamma) Phosphatidylinositol 4,5-bisphosphate 3-kinase catalytic subunit gamma isoform (PI3K) Phosphatidylinositol-4,5-bisphosphate 3-kinase catalytic subunit gamma isoform Phosphoinositide 3-kinases gamma (PI3K gamma) p120-PI3K
Type:
Enzyme Subunit
Mol. Mass.:
126470.30
Organism:
Homo sapiens (Human)
Description:
P48736
Residue:
1102
  
Inhibitor
Name:
BDBM50449308
Synonyms:
CHEMBL3125376
Type:
Small organic molecule
Emp. Form.:
C18H19N3O4S
Mol. Mass.:
373.426
SMILES:
OC(=O)c1sc(nc1CC(=O)N1CCc2ccccc12)N1CCOCC1
: