Target
Retinal rod rhodopsin-sensitive cGMP 3',5'-cyclic phosphodiesterase subunit delta
Ligand
BDBM50019807
Substrate
Meas. Tech.
ChEMBL_1361547 (CHEMBL3294871)
Kd
251±n/a nM
Citation
 Zimmermann, GSchultz-Fademrecht, CKüchler, PMurarka, SIsmail, STriola, GNussbaumer, PWittinghofer, AWaldmann, H Structure guided design and kinetic analysis of highly potent benzimidazole inhibitors targeting the PDEd prenyl binding site. J Med Chem 57:5435-48 (2014)  
Target
Name:
Retinal rod rhodopsin-sensitive cGMP 3',5'-cyclic phosphodiesterase subunit delta
Synonyms:
3',5'-cyclic phosphodiesterase PDE6D PDED Retinal rod rhodopsin-sensitive cGMP 3',5'-cyclic phosphodiesterase subunit delta
Type:
PROTEIN
Mol. Mass.:
17418.30
Organism:
Homo sapiens (Human)
Description:
ChEMBL_105761
Residue:
150
  
Inhibitor
Name:
BDBM50019807
Synonyms:
CHEMBL3286894
Type:
Small organic molecule
Emp. Form.:
C40H36FN5O
Mol. Mass.:
621.7451
SMILES:
Fc1ccc(Cn2c(nc3ccccc23)-c2ccc(OCC(C3CCNCC3)n3c(nc4ccccc34)-c3ccccc3)cc2)cc1
: