Target
Acetylcholinesterase
Ligand
BDBM50022775
Substrate
Meas. Tech.
ChEMBL_1438379 (CHEMBL3383054)
IC50
28300±n/a nM
Citation
 Khan, IIbrar, AZaib, SAhmad, SFurtmann, NHameed, SSimpson, JBajorath, JIqbal, J Active compounds from a diverse library of triazolothiadiazole and triazolothiadiazine scaffolds: synthesis, crystal structure determination, cytotoxicity, cholinesterase inhibitory activity, and binding mode analysis. Bioorg Med Chem 22:6163-73 (2014)  
Target
Name:
Acetylcholinesterase
Synonyms:
ACES_ELEEL Acetylcholinesterase (EeAChE) | ache
Type:
Enzyme
Mol. Mass.:
71812.79
Organism:
Electrophorus electricus (Electric eel)
Description:
Residue:
633
  
Inhibitor
Name:
BDBM50022775
Synonyms:
(m-Hydroxyphenyl)trimethylammonium dimethylcarbamate 3-[(dimethylcarbamoyl)oxy]-N,N,N-trimethylanilinium CHEMBL278020 Eustigmine Neostigmine (2) Vagostigmine | m-Trimethylammoniumphenyldimethylcarbamate
Type:
Small organic molecule
Emp. Form.:
C12H19N2O2
Mol. Mass.:
223.2909
SMILES:
CN(C)C(=O)Oc1cccc(c1)[N+](C)(C)C
: