Target
Tyrosine-protein kinase JAK1
Ligand
BDBM50031762
Substrate
Meas. Tech.
ChEMBL_1432584 (CHEMBL3388143)
IC50
184±n/a nM
Citation
 Menet, CJFletcher, SRVan Lommen, GGeney, RBlanc, JSmits, KJouannigot, NDeprez, Pvan der Aar, EMClement-Lacroix, PLepescheux, LGalien, RVayssiere, BNelles, LChristophe, TBrys, RUhring, MCiesielski, FVan Rompaey, L Triazolopyridines as selective JAK1 inhibitors: from hit identification to GLPG0634. J Med Chem 57:9323-42 (2014)  
Target
Name:
Tyrosine-protein kinase JAK1
Synonyms:
JAK-1 JAK1A JAK1_HUMAN Janus kinase 1 (JAK1) | Janus kinase 1 JAK1
Type:
Protein
Mol. Mass.:
133293.73
Organism:
Homo sapiens (Human)
Description:
P23458
Residue:
1154
  
Inhibitor
Name:
BDBM50031762
Synonyms:
CHEMBL3360332
Type:
Small organic molecule
Emp. Form.:
C16H14N4O
Mol. Mass.:
278.3086
SMILES:
O=C(Nc1nc2cccc(-c3ccccc3)n2n1)C1CC1
: