Target
Sphingosine 1-phosphate receptor 3
Ligand
BDBM50041980
Substrate
Meas. Tech.
ChEMBL_1443670 (CHEMBL3380143)
EC50
>10000±n/a nM
Citation
 Buzard, DJLopez, LMoody, JKawasaki, ASchrader, TOKasem, MJohnson, BZhu, XThoresen, LKim, SHGharbaoui, TSengupta, DCalvano, LKrishnan, AGao, YSemple, GEdwards, JBarden, JMorgan, MUsmani, KChen, CSadeque, AChen, WChristopher, RJThatte, JFu, LSolomon, MWhelan, KAl-Shamma, HGatlin, JGaidarov, IAnthony, TLe, MUnett, DJStirn, SBlackburn, ABehan, DPJones, RM (7-Benzyloxy-2,3-dihydro-1H-pyrrolo[1,2-a]indol-1-yl)acetic Acids as S1P1 Functional Antagonists. ACS Med Chem Lett 5:1334-9 (2014)  
Target
Name:
Sphingosine 1-phosphate receptor 3
Synonyms:
C9orf108 EDG3 S1P receptor 3 S1P3 S1PR3_HUMAN Sphingosine 1-phosphate receptor 3 (S1P3) | Sphingosine 1-phosphate receptor Edg-3
Type:
G Protein-Coupled Receptor (GPCR)
Mol. Mass.:
42278.13
Organism:
Homo sapiens (Human)
Description:
Q99500
Residue:
378
  
Inhibitor
Name:
BDBM50041980
Synonyms:
CHEMBL3359519
Type:
Small organic molecule
Emp. Form.:
C24H24F3NO4
Mol. Mass.:
447.4469
SMILES:
CC(C)Oc1ccc(COc2ccc3n4CCC(CC(O)=O)c4cc3c2)cc1C(F)(F)F
: