Target
Glucose-dependent insulinotropic receptor
Ligand
BDBM50056018
Substrate
Meas. Tech.
ChEMBL_1447044 (CHEMBL3374950)
EC50
69±n/a nM
Citation
 Buzard, DJKim, SHLehmann, JHan, SCalderon, IWong, AKawasaki, ANarayanan, SBhat, RGharbaoui, TLopez, LYue, DWhelan, KAl-Shamma, HUnett, DJShu, HHTung, SFChang, SChuang, CFMorgan, MSadeque, AChu, ZLLeonard, JNJones, RM Discovery and optimization of 5-fluoro-4,6-dialkoxypyrimidine GPR119 agonists. Bioorg Med Chem Lett 24:4332-5 (2014)  
Target
Name:
Glucose-dependent insulinotropic receptor
Synonyms:
GP119_RAT | Gpr119
Type:
PROTEIN
Mol. Mass.:
51687.59
Organism:
Rattus norvegicus
Description:
ChEMBL_1506411
Residue:
468
  
Inhibitor
Name:
BDBM50056018
Synonyms:
CHEMBL3326681
Type:
Small organic molecule
Emp. Form.:
C20H23F3N4O5S
Mol. Mass.:
488.481
SMILES:
CCC(F)(F)C(=O)N1CCC(CC1)Oc1ncnc(Oc2ccc(nc2C)S(C)(=O)=O)c1F
: