Target
Multidrug resistance-associated protein 1
Ligand
BDBM50056300
Substrate
Meas. Tech.
ChEMBL_1449769 (CHEMBL3378756)
IC50
>100000±n/a nM
Citation
 Tardia, PStefanachi, ANiso, MStolfa, DAMangiatordi, GFAlberga, DNicolotti, OLattanzi, GCarotti, ALeonetti, FPerrone, RBerardi, FAzzariti, AColabufo, NACellamare, S Trimethoxybenzanilide-based P-glycoprotein modulators: an interesting case of lipophilicity tuning by intramolecular hydrogen bonding. J Med Chem 57:6403-18 (2014)  
Target
Name:
Multidrug resistance-associated protein 1
Synonyms:
7.6.2.2 ABCC1 ATP-binding cassette, sub-family C, member 1 isoform 1 LTC4 transporter MRP MRP1_HUMAN
Type:
Mol. Mass.:
171597.72
Organism:
Homo sapiens (Human)
Description:
P33527
Residue:
1531
  
Inhibitor
Name:
BDBM50056300
Synonyms:
CHEMBL3317925
Type:
Small organic molecule
Emp. Form.:
C21H19FN2O4
Mol. Mass.:
382.385
SMILES:
COc1cc(OC)c(C(=O)Nc2ccc(cc2F)-c2cccnc2)c(OC)c1
: