Target
Beta-glucuronidase
Ligand
BDBM50092444
Substrate
Meas. Tech.
ChEMBL_1500707 (CHEMBL3588057)
IC50
2140±n/a nM
Citation
 Zawawi, NKTaha, MAhmat, NWadood, AIsmail, NHRahim, FAli, MAbdullah, NKhan, KM Novel 2,5-disubtituted-1,3,4-oxadiazoles with benzimidazole backbone: a new class of฿-glucuronidase inhibitors and in silico studies. Bioorg Med Chem 23:3119-25 (2015)  
Target
Name:
Beta-glucuronidase
Synonyms:
β-Glucuronidase Beta-G1 GUSB | beta-Glucuronidase (β-glucuronidase)
Type:
Protein
Mol. Mass.:
74736.05
Organism:
Homo sapiens (Human)
Description:
Residue:
651
  
Inhibitor
Name:
BDBM50092444
Synonyms:
CHEMBL3586121
Type:
Small organic molecule
Emp. Form.:
C23H18N4O2
Mol. Mass.:
382.4146
SMILES:
Cc1cc2nc([nH]c2cc1C)-c1ccc(cc1)-c1nnc(o1)-c1ccccc1O
: