Target
Phosphatidylinositol 4,5-bisphosphate 3-kinase catalytic subunit gamma isoform
Ligand
BDBM50137685
Substrate
Meas. Tech.
ChEMBL_1549502 (CHEMBL3755828)
IC50
9360±n/a nM
Citation
 Lv, XHLi, QSRen, ZLChu, MJSun, JZhang, XXing, MZhu, HLCao, HQ (E)-1,3-diphenyl-1H-pyrazole derivatives containing O-benzyl oxime moiety as potential immunosuppressive agents: Design, synthesis, molecular docking and biological evaluation. Eur J Med Chem 108:586-93 (2016)  
Target
Name:
Phosphatidylinositol 4,5-bisphosphate 3-kinase catalytic subunit gamma isoform
Synonyms:
PI3-kinase p110 subunit gamma PI3Kgamma PK3CG_HUMAN Phosphatidylinositol 4,5-bisphosphate 3-kinase (PI3K) Phosphatidylinositol 4,5-bisphosphate 3-kinase catalytic subunit gamma (PI3Kgamma) Phosphatidylinositol 4,5-bisphosphate 3-kinase catalytic subunit gamma isoform (PI3K) Phosphatidylinositol-4,5-bisphosphate 3-kinase catalytic subunit gamma isoform Phosphoinositide 3-kinases gamma (PI3K gamma) p120-PI3K
Type:
Enzyme Subunit
Mol. Mass.:
126470.30
Organism:
Homo sapiens (Human)
Description:
P48736
Residue:
1102
  
Inhibitor
Name:
BDBM50137685
Synonyms:
CHEMBL3753973
Type:
Small organic molecule
Emp. Form.:
C23H16Cl3N3O
Mol. Mass.:
456.752
SMILES:
Clc1ccc(cc1)-c1nn(cc1\C=N\OCc1ccc(Cl)cc1Cl)-c1ccccc1
: