Target
Oxidized purine nucleoside triphosphate hydrolase
Ligand
BDBM50152142
Substrate
Meas. Tech.
ChEMBL_1565467 (CHEMBL3782136)
IC50
112±n/a nM
Citation
 Petrocchi, ALeo, EReyna, NJHamilton, MMShi, XParker, CAMseeh, FBardenhagen, JPLeonard, PCross, JBHuang, SJiang, YCardozo, MDraetta, GMarszalek, JRToniatti, CJones, PLewis, RT Identification of potent and selective MTH1 inhibitors. Bioorg Med Chem Lett 26:1503-7 (2016)  
Target
Name:
Oxidized purine nucleoside triphosphate hydrolase
Synonyms:
7,8-dihydro-8-oxoguanine triphosphatase MTH1 NUDT1
Type:
Protein
Mol. Mass.:
22514.81
Organism:
Homo sapiens (Human)
Description:
P36639
Residue:
197
  
Inhibitor
Name:
BDBM50152142
Synonyms:
CHEMBL3781493
Type:
Small organic molecule
Emp. Form.:
C10H17N3O
Mol. Mass.:
195.2615
SMILES:
Cc1cc(OCC(C)(C)C)nc(N)n1
: