Target
Bromodomain-containing protein 4
Ligand
BDBM50200389
Substrate
Meas. Tech.
ChEBML_1622038
IC50
7300±n/a nM
Citation
 Crawford, TDRomero, FALai, KWTsui, VTaylor, AMde Leon Boenig, GNoland, CLMurray, JLy, JChoo, EFHunsaker, TLChan, EWMerchant, MKharbanda, SGascoigne, KEKaufman, SBeresini, MHLiao, JLiu, WChen, KXChen, ZConery, ARCôté, AJayaram, HJiang, YKiefer, JRKleinheinz, TLi, YMaher, JPardo, EPoy, FSpillane, KLWang, FWang, JWei, XXu, ZXu, ZYen, IZawadzke, LZhu, XBellon, SCummings, RCochran, AGAlbrecht, BKMagnuson, S Discovery of a Potent and Selective in Vivo Probe (GNE-272) for the Bromodomains of CBP/EP300. J Med Chem 59:10549-10563 (2016)  
Target
Name:
Bromodomain-containing protein 4
Synonyms:
BRD4 Bromodomain-containing protein 4 (BRD4) Protein HUNK1
Type:
Protein
Mol. Mass.:
152264.84
Organism:
Homo sapiens (Human)
Description:
O60885
Residue:
1362
  
Inhibitor
Name:
BDBM50200389
Synonyms:
CHEMBL3936675 | US9763922, Example 195
Type:
Small organic molecule
Emp. Form.:
C21H23N5O
Mol. Mass.:
361.4402
SMILES:
CC(=O)N1CCc2c(C1)c(Nc1cccc(C)c1)nn2Cc1ccccn1
: