Target
Kynurenine 3-monooxygenase
Ligand
BDBM50206609
Substrate
Meas. Tech.
ChEMBL_1629193 (CHEMBL3871819)
IC50
22±n/a nM
Citation
 Amin, SAAdhikari, NJha, TGayen, S First molecular modeling report on novel arylpyrimidine kynurenine monooxygenase inhibitors through multi-QSAR analysis against Huntington's disease: A proposal to chemists! Bioorg Med Chem Lett 26:5712-5718 (2016)  
Target
Name:
Kynurenine 3-monooxygenase
Synonyms:
KMO | KMO_HUMAN
Type:
PROTEIN
Mol. Mass.:
55831.03
Organism:
Homo sapiens (Human)
Description:
ChEMBL_1487479
Residue:
486
  
Inhibitor
Name:
BDBM50206609
Synonyms:
CHEMBL3968864
Type:
Small organic molecule
Emp. Form.:
C12H7F3N2O2
Mol. Mass.:
268.1914
SMILES:
OC(=O)c1nccc(n1)-c1cccc(c1)C(F)(F)F
: