Target
Poly [ADP-ribose] polymerase tankyrase-1
Ligand
BDBM50238423
Substrate
Meas. Tech.
ChEMBL_1663210 (CHEMBL4012891)
IC50
10000±n/a nM
Citation
 Thomson, DWWagner, AJBantscheff, MBenson, REDittus, LDuempelfeld, BDrewes, GKrause, JMoore, JTMueller, KPoeckel, DRau, CSalzer, EShewchuk, LHopf, CEmery, JGMuelbaier, M Discovery of a Highly Selective Tankyrase Inhibitor Displaying Growth Inhibition Effects against a Diverse Range of Tumor Derived Cell Lines. J Med Chem 60:5455-5471 (2017)  
Target
Name:
Poly [ADP-ribose] polymerase tankyrase-1
Synonyms:
(ARTD5 or PARP5a) PARPL Poly [ADP-ribose] polymerase tankyrase-1 TINF1 TNKS1 Tankyrase 1 Tankyrase-1 Tankyrase-1 (TNKS1)
Type:
Enzyme
Mol. Mass.:
142058.03
Organism:
Homo sapiens (Human)
Description:
O95271
Residue:
1327
  
Inhibitor
Name:
BDBM50238423
Synonyms:
CHEMBL4080509
Type:
Small organic molecule
Emp. Form.:
C19H17N7O2
Mol. Mass.:
375.384
SMILES:
O=C(N1CCOCC1)c1cccc(Nc2nc3ccccc3n3nnnc23)c1
: