Target
Phosphatidylinositol 4,5-bisphosphate 3-kinase catalytic subunit alpha isoform
Ligand
BDBM132098
Substrate
Meas. Tech.
ADP-Glo Kinase Assay
Temperature
298.15±n/a K
IC50
140±n/a nM
Comments
extracted
Citation
 Sorba, GTron, GCGalli, UMassarotti, AHirsch, ECiraolo, EPirali, T Quinolin-4 (1H)-one derivatives as inhibitors of phosphatidylinositol 3-kinases US Patent  US8841288 Publication Date 9/23/2014 
Target
Name:
Phosphatidylinositol 4,5-bisphosphate 3-kinase catalytic subunit alpha isoform
Synonyms:
P42336 PI3-kinase subunit p110-alpha PIK3CA Phosphatidylinositol 3-kinase alpha (PI3Kalpha) Phosphatidylinositol 4,5-bisphosphate 3-kinase (PI3K) Phosphatidylinositol 4,5-bisphosphate 3-kinase catalytic subunit alpha (PI3Kalpha) Phosphatidylinositol 4,5-bisphosphate 3-kinase catalytic subunit alpha isoform (PI3-Ka) Phosphatidylinositol 4,5-bisphosphate 3-kinase catalytic subunit alpha isoform (PI3K p110alpha) Phosphatidylinositol 4,5-bisphosphate 3-kinase catalytic subunit alpha isoform (PI3K-alpha) Phosphatidylinositol 4,5-bisphosphate 3-kinase catalytic subunit alpha isoform (PI3Kalpha p110alpha) Phosphatidylinositol 4,5-bisphosphate 3-kinase catalytic subunit alpha isoform (PIK3CA) Phosphatidylinositol-4,5-bisphosphate 3-kinase catalytic subunit alpha isoform Phosphoinositide 3-Kinase (PI3K), alpha Chain A Phosphoinositide 3-kinases (PI3K) PtdIns-3-kinase p110 | p110 alpha
Type:
Enzyme Subunit
Mol. Mass.:
124294.87
Organism:
Homo sapiens (Human)
Description:
P42336
Residue:
1068
  
Inhibitor
Name:
BDBM132098
Synonyms:
US8841288, CL 129A
Type:
Small organic molecule
Emp. Form.:
C30H28N6O3
Mol. Mass.:
520.5817
SMILES:
O=C(NCc1ccccc1)c1cccc(Cn2cc(nn2)-c2cccc3c2[nH]c(cc3=O)N2CCOCC2)c1
: