Target
[Pyruvate dehydrogenase (acetyl-transferring)] kinase isozyme 2, mitochondrial
Ligand
BDBM137954
Substrate
Meas. Tech.
Inhibition Assay
pH
8±n/a
Temperature
303.15±n/a K
IC50
62±n/a nM
Comments
extracted
Citation
 Motomura, TNagamori, HSuzawa, KIto, HMorita, TKobayashi, SShinkai, H Fluorene compound and pharmaceutical use thereof US Patent  US8871934 Publication Date 10/28/2014 
Target
Name:
[Pyruvate dehydrogenase (acetyl-transferring)] kinase isozyme 2, mitochondrial
Synonyms:
PDHK2 PDK2_HUMAN Pyruvate dehydrogenase kinase isoenzyme 1 (PDK2)
Type:
Enzyme
Mol. Mass.:
46153.78
Organism:
Homo sapiens (Human)
Description:
Q15119
Residue:
407
  
Inhibitor
Name:
BDBM137954
Synonyms:
US8871934, 547
Type:
Small organic molecule
Emp. Form.:
C28H27F3N2O2
Mol. Mass.:
480.5214
SMILES:
OC1(c2ccccc2-c2c1cccc2-c1cnn(CC23CC4CC(CC(O)(C4)C2)C3)c1)C(F)(F)F
: