Target
Urease [D459Y,K653P]
Ligand
BDBM152589
Substrate
Meas. Tech.
Urease Inhibition Assay
pH
8.2±n/a
IC50
592± 2.4e+2 nM
Comments
extracted
Citation
 Hameed, AKhan, KMZehra, STAhmed, RShafiq, ZBakht, SMYaqub, MHussain, Mde la Vega de León, AFurtmann, NBajorath, JShad, HATahir, MNIqbal, J Synthesis, biological evaluation and molecular docking of N-phenyl thiosemicarbazones as urease inhibitors. Bioorg Chem 61:51-7 (2015)  
Target
Name:
Urease [D459Y,K653P]
Synonyms:
UREA_CANEN Urease
Type:
Protein
Mol. Mass.:
90763.23
Organism:
Canavalia ensiformis (Jack bean)
Description:
P07374[D459Y,K653P]
Residue:
840
  
Inhibitor
Name:
BDBM152589
Synonyms:
2-(1-(Benzofuran-2-yl)ethylidene)-N-(2,4-dichlorophenyl)-hydrazinecarbothioamide (3c)
Type:
Small organic molecule
Emp. Form.:
C17H13Cl2N3OS
Mol. Mass.:
378.276
SMILES:
CC(=NNC(=S)Nc1ccc(Cl)cc1Cl)c1cc2ccccc2o1
: