Target
Androgen receptor
Ligand
BDBM143706
Substrate
Meas. Tech.
Androgen Receptor Assay
pH
7.4±n/a
Temperature
298.15±n/a K
IC50
7.10±n/a nM
Comments
extracted
Citation
 Labrie, FSingh, SMLabrecque, RCiobanu, LC Non-steroidal antiandrogens and selective androgen receptor modulators with a pyridyl moiety US Patent  US9682960 Publication Date 6/20/2017 
Target
Name:
Androgen receptor
Synonyms:
ANDR_MOUSE Nr3c4
Type:
PROTEIN
Mol. Mass.:
98196.62
Organism:
Mus musculus
Description:
ChEMBL_945930
Residue:
899
  
Inhibitor
Name:
BDBM143706
Synonyms:
US9682960, EM-8360
Type:
Small organic molecule
Emp. Form.:
C22H21Cl2N3O4S2
Mol. Mass.:
526.456
SMILES:
CC1(C)N(CCCOc2ccc(cc2Cl)S(C)(=O)=O)C(=S)N(C1=O)c1ccc(C#N)c(Cl)c1
: