Target
Androgen receptor
Ligand
BDBM145959
Substrate
Meas. Tech.
Androgen Receptor Assay
pH
7.4±n/a
Temperature
298.15±n/a K
IC50
173±n/a nM
Comments
extracted
Citation
 Labrie, FSingh, SMLabrecque, RCiobanu, LC Non-steroidal antiandrogens and selective androgen receptor modulators with a pyridyl moiety US Patent  US9682960 Publication Date 6/20/2017 
Target
Name:
Androgen receptor
Synonyms:
ANDR_MOUSE Nr3c4
Type:
PROTEIN
Mol. Mass.:
98196.62
Organism:
Mus musculus
Description:
ChEMBL_945930
Residue:
899
  
Inhibitor
Name:
BDBM145959
Synonyms:
US9682960, EM-9126
Type:
Small organic molecule
Emp. Form.:
C28H25F3N4O3
Mol. Mass.:
522.5183
SMILES:
CC1(C)N(CCCOc2ccc(cc2)-c2ccncc2)C(=O)CN(C1=O)c1ccc(C#N)c(c1)C(F)(F)F
: