Target
Androgen receptor
Ligand
BDBM146945
Substrate
Meas. Tech.
Androgen Receptor Assay
pH
7.4±n/a
Temperature
298.15±n/a K
IC50
21±n/a nM
Comments
extracted
Citation
 Labrie, FSingh, SMLabrecque, RCiobanu, LC Non-steroidal antiandrogens and selective androgen receptor modulators with a pyridyl moiety US Patent  US9682960 Publication Date 6/20/2017 
Target
Name:
Androgen receptor
Synonyms:
ANDR_MOUSE Nr3c4
Type:
PROTEIN
Mol. Mass.:
98196.62
Organism:
Mus musculus
Description:
ChEMBL_945930
Residue:
899
  
Inhibitor
Name:
BDBM146945
Synonyms:
US9682960, EM-9343
Type:
Small organic molecule
Emp. Form.:
C25H21ClN4O2
Mol. Mass.:
444.913
SMILES:
Cc1c(Cl)c(ccc1N1C(=O)N(Cc2ccc(cc2)-c2ccncc2)C(C)(C)C1=O)C#N
: