Target
11-beta-hydroxysteroid dehydrogenase 1
Ligand
BDBM167437
Substrate
Meas. Tech.
Homogenous Time-Resolved Fluorescence (HTRF) Assay
IC50
3±n/a nM
Citation
 Kim, KYAhn, JHKang, SKRhee, SDBae, MAAhn, SHKim, HYJung, WHKang, NS Sulfamide derivative having an adamantyl group and its pharmaceutically acceptable salt US Patent  US9073906 Publication Date 7/7/2015 
Target
Name:
11-beta-hydroxysteroid dehydrogenase 1
Synonyms:
11-DH 11-beta-Hydroxysteroid Dehydrogenase 1 (11-beta-HSD1) 11-beta-hydroxysteroid dehydrogenase 1 (11HSD1) Corticosteroid 11-beta-dehydrogenase isozyme 1 (11-beta-HSD-1) Corticosteroid 11-beta-dehydrogenase isozyme 1 (11beta-HSD1) HSD11 HSD11L | SDR26C1
Type:
Enzyme
Mol. Mass.:
32409.16
Organism:
Homo sapiens (Human)
Description:
P28845
Residue:
292
  
Inhibitor
Name:
BDBM167437
Synonyms:
US9073906, 69
Type:
Small organic molecule
Emp. Form.:
C22H29FN4O4S
Mol. Mass.:
464.553
SMILES:
NC(=O)C12CC3CC(C1)C(NC(=O)CN1CCCN(c4cccc(F)c4)S1(=O)=O)C(C3)C2
: