Target
Oligo-1,6-glucosidase IMA1
Ligand
BDBM173556
Substrate
Meas. Tech.
Baker's Yeast alpha-Glucosidase Inhibition Assay
pH
6.8±n/a
Temperature
310.15±n/a K
IC50
5.022e+4± 8.6e+2 nM
Comments
extracted
Citation
 Zawawi, NKTaha, MAhmat, NIsmail, NHWadood, ARahim, FRehman, AU Synthesis, in vitro evaluation and molecular docking studies of biscoumarin thiourea as a new inhibitor of a-glucosidases. Bioorg Chem 63:36-44 (2015)  
Target
Name:
Oligo-1,6-glucosidase IMA1
Synonyms:
α-glucosidase Alpha-glucosidase (α-glucosidase) MALX3_YEAST | Oligo-1,6-glucosidase
Type:
Protein
Mol. Mass.:
68577.59
Organism:
Saccharomyces cerevisiae S288c (Baker's yeast)
Description:
Residue:
589
  
Inhibitor
Name:
BDBM173556
Synonyms:
1-(4-(bis(4-Hydroxy-2-oxo-2H-chromen-3-yl)methyl)phenyl)-3-(p-tolyl)thiourea (13)
Type:
Small organic molecule
Emp. Form.:
C33H24N2O6S
Mol. Mass.:
576.618
SMILES:
Cc1ccccc1NC(=S)Nc1ccc(cc1)C(c1c(O)c2ccccc2oc1=O)c1c(O)c2ccccc2oc1=O
: