Target
ATP-dependent translocase ABCB1
Ligand
BDBM202565
Substrate
Meas. Tech.
Calcein-AM Assay
IC50
7.62e+4± 1.06e+4 nM
Citation
 Stefanachi, AMangiatordi, GFTardia, PAlberga, DLeonetti, FNiso, MColabufo, NAAdamo, CNicolotti, OCellamare, S Design, synthesis, biological evaluation, NMR and DFT studies of structurally simplified trimethoxy benzamides as selective P-glycoprotein inhibitors: the role of molecular flatness. Chem Biol Drug Des 88:820-831 (2016)  
Target
Name:
ATP-dependent translocase ABCB1
Synonyms:
ABCB1 MDR1_HUMAN Multidrug resistance protein 1 P-glycoprotein (P-gp) PGY1
Type:
Protein
Mol. Mass.:
141503.50
Organism:
Homo sapiens (Human)
Description:
P08183
Residue:
1280
  
Inhibitor
Name:
BDBM202565
Synonyms:
N-(4-Bromo-phenyl)-2,4,6-trimethoxy-benzamide (12)
Type:
Small organic molecule
Emp. Form.:
C16H16BrNO4
Mol. Mass.:
366.207
SMILES:
COc1cc(OC)c(C(=O)Nc2ccc(Br)cc2)c(OC)c1
: