Target
Acetylcholinesterase
Ligand
BDBM8960
Substrate
Meas. Tech.
AChE and BuChE Inhibition Assay
pH
8±n/a
Temperature
298.15±n/a K
IC50
59± 5e+1 nM
Comments
extracted
Citation
 Leng, JQin, HLZhu, KJantan, IHussain, MASher, MAmjad, MWNaeem-Ul-Hassan, MAhmad, WBukhari, SN Evaluation of multifunctional synthetic tetralone derivatives for treatment of Alzheimer's disease. Chem Biol Drug Des 88:889-898 (2016)  
Target
Name:
Acetylcholinesterase
Synonyms:
ACES_ELEEL Acetylcholinesterase (EeAChE) | ache
Type:
Enzyme
Mol. Mass.:
71812.79
Organism:
Electrophorus electricus (Electric eel)
Description:
Residue:
633
  
Inhibitor
Name:
BDBM8960
Synonyms:
(+/-)-2-[(1-benzylpiperidin-4-yl)methyl]-5,6-dimethoxy-indan-1-one Aricept CHEMBL1678 CHEMBL502 Donepezil E2020 US9346818, DPH US9663465, Donepezil
Type:
Small organic molecule
Emp. Form.:
C24H29NO3
Mol. Mass.:
379.492
SMILES:
COc1cc2CC(CC3CCN(Cc4ccccc4)CC3)C(=O)c2cc1OC
: