Target
Carboxylic ester hydrolase
Ligand
BDBM203849
Substrate
Meas. Tech.
AChE and BuChE Inhibition Assay
pH
8±n/a
Temperature
298.15±n/a K
IC50
>1.00e+5±n/a nM
Comments
extracted
Citation
 Leng, JQin, HLZhu, KJantan, IHussain, MASher, MAmjad, MWNaeem-Ul-Hassan, MAhmad, WBukhari, SN Evaluation of multifunctional synthetic tetralone derivatives for treatment of Alzheimer's disease. Chem Biol Drug Des 88:889-898 (2016)  
Target
Name:
Carboxylic ester hydrolase
Synonyms:
BuChE Butyrylcholine esterase Butyrylcholinesterase (BChE) Butyrylcholinesterase (EqBuChE) butyrylcholinesterase precursor
Type:
Protein
Mol. Mass.:
68842.83
Organism:
Equus caballus (Horse)
Description:
Q9N1N9
Residue:
602
  
Inhibitor
Name:
BDBM203849
Synonyms:
(2E)-2-[(2-chloro-3-methoxyphenyl)methylidene]-5,8-dimethoxy-1,2,3,4-tetrahydronaphthalen-1-one (3v)
Type:
Small organic molecule
Emp. Form.:
C20H19ClO4
Mol. Mass.:
358.815
SMILES:
COc1cccc(\C=C2/CCc3c(OC)ccc(OC)c3C2=O)c1Cl
: