Target
Amine oxidase [flavin-containing] B
Ligand
BDBM203845
Substrate
Meas. Tech.
Monoamine Oxidase Assay
pH
7.4±n/a
Temperature
311.15±n/a K
IC50
5.60e+4± 4.2e+3 nM
Comments
extracted
Citation
 Leng, JQin, HLZhu, KJantan, IHussain, MASher, MAmjad, MWNaeem-Ul-Hassan, MAhmad, WBukhari, SN Evaluation of multifunctional synthetic tetralone derivatives for treatment of Alzheimer's disease. Chem Biol Drug Des 88:889-898 (2016)  
Target
Name:
Amine oxidase [flavin-containing] B
Synonyms:
AOFB_RAT Amine oxidase [flavin-containing] B Monoamine Oxidase Type B (MAO-B) Monoamine oxidase B (MAO-B) Monoamine oxidase type B (MAOB) | Monoamine oxidase-B (MAO-B)
Type:
Enzyme
Mol. Mass.:
58469.65
Organism:
Rattus norvegicus (rat)
Description:
P19643
Residue:
520
  
Inhibitor
Name:
BDBM203845
Synonyms:
(2E)-2-[(2-bromo-3,4,5-trimethoxyphenyl)methylidene]-5-methoxy-1,2,3,4-tetrahydronaphthalen-1-one (3r)
Type:
Small organic molecule
Emp. Form.:
C21H21BrO5
Mol. Mass.:
433.292
SMILES:
COc1cccc2C(=O)\C(CCc12)=C\c1cc(OC)c(OC)c(OC)c1Br
: