Target
Procathepsin L
Ligand
BDBM210847
Substrate
BDBM210882
Meas. Tech.
Cathepsin Enzyme Inhibition Assay
pH
6.5±n/a
IC50
10.4±n/a nM
Comments
extracted
Citation
 Anselm, LBanner, DBlanc, JGaufreteau, DHaap, WHartmann, GKuhn, BLuebbers, TPeters, JSpinnler, B Cyclic amides US Patent  US9290467 Publication Date 3/22/2016 
Target
Name:
Procathepsin L
Synonyms:
CATL1_HUMAN CTSL CTSL1 Cathepsin L Cathepsin L1 heavy chain MEP cathepsin L preproprotein
Type:
Enzyme
Mol. Mass.:
37557.19
Organism:
Homo sapiens (Human)
Description:
Purchased from Calbiochem (San Diego, CA).
Residue:
333
  
Inhibitor
Name:
BDBM210847
Synonyms:
US9290467, 17
Type:
Small organic molecule
Emp. Form.:
C25H26ClN3O5
Mol. Mass.:
483.944
SMILES:
COc1ccc2OCCCCOc3ccc(C[C@H](NC(=O)c2c1)C(=O)NC1(CC1)C#N)cc3Cl
:
Substrate
Name:
BDBM210882
Synonyms:
Type:
Small organic molecule
Emp. Form.:
C34H45N7O7
Mol. Mass.:
663.7638
SMILES:
[#6]-[#6](-[#6])-[#6@H](-[#7]-[#6](=O)-[#8]-[#6]-c1ccccc1)-[#6](=O)-[#7]-[#6@@H](-[#6](-[#6])-[#6])-[#6](=O)-[#7]-[#6@@H](-[#6]-[#6]-[#6]\[#7]=[#6](\[#7])-[#7])-[#6](=O)-[#7]-c1ccc2c(-[#6])cc(=O)oc2c1
: