Target
E3 ubiquitin-protein ligase XIAP [124-240]
Ligand
BDBM237653
Substrate
Meas. Tech.
TR-FRET Assay
pH
7.5±n/a
Temperature
298.15±n/a K
IC50
21±n/a nM
Comments
extracted
Citation
 Donnell, AFHan, XKester, RFKong, NLe, KLou, YMichoud, CMoliterni, JARemiszewski, SRupert, KCYun, W Substituted hetero-azepinones US Patent  US9394263 Publication Date 7/19/2016 
Target
Name:
E3 ubiquitin-protein ligase XIAP [124-240]
Synonyms:
API3 Baculoviral IAP repeat-containing protein 2 (BIR2) E3 ubiquitin-protein ligase XIAP BIR2 XIAP XIAP_HUMAN
Type:
Protein
Mol. Mass.:
13562.46
Organism:
Artificial Sequence
Description:
TR-FRET peptide Corresponds to amino acids 124-240 of human XIAP.
Residue:
117
  
Inhibitor
Name:
BDBM237653
Synonyms:
US9394263, 65
Type:
Small organic molecule
Emp. Form.:
C30H26N6O3
Mol. Mass.:
518.5658
SMILES:
CN[C@@H](C)C(=O)N[C@H]1COc2ccccc2N(Cc2cccc3n(c(cc23)C#N)-c2ccccc2C#N)C1=O
: