Target
E3 ubiquitin-protein ligase XIAP [241-356]
Ligand
BDBM237653
Substrate
Meas. Tech.
TR-FRET Assay
pH
7.5±n/a
Temperature
298.15±n/a K
IC50
13630±n/a nM
Comments
extracted
Citation
 Donnell, AFHan, XKester, RFKong, NLe, KLou, YMichoud, CMoliterni, JARemiszewski, SRupert, KCYun, W Substituted hetero-azepinones US Patent  US9394263 Publication Date 7/19/2016 
Target
Name:
E3 ubiquitin-protein ligase XIAP [241-356]
Synonyms:
API3 BIRC4 E3 ubiquitin-protein ligase XIAP BIR-3 IAP3 X-linked inhibitor of apoptosis protein BIR3 domain (XIAP BIR-3) XIAP-BIR3 baculovirus IAP repeat 3 (BIR3) domain of XIAP
Type:
Protein Binding Domain
Mol. Mass.:
13276.62
Organism:
Homo sapiens (Human)
Description:
BIR3 of XIAP: RESIDUES 241-356.
Residue:
116
  
Inhibitor
Name:
BDBM237653
Synonyms:
US9394263, 65
Type:
Small organic molecule
Emp. Form.:
C30H26N6O3
Mol. Mass.:
518.5658
SMILES:
CN[C@@H](C)C(=O)N[C@H]1COc2ccccc2N(Cc2cccc3n(c(cc23)C#N)-c2ccccc2C#N)C1=O
: