BDBM112465 US8623885, 6
SMILES C[C@H]1CC[C@@H](CC1)n1c2cnccc2c2cnc(Nc3ccc4CN(CCc4n3)C(=O)C(O)=O)nc12
InChI Key InChIKey=JQNUCFXJVXYPNW-JCNLHEQBSA-N
Data  2 IC50
  Tab Delimited (TSV)   2D SDfile   Computed 3D by Vconf -m prep SDfile
Find this compound or compounds like it in BindingDB:
Activity Spreadsheet -- Enzyme Inhibition Constant Data from BindingDB
Found 2 hits for monomerid = 112465
TargetCyclin-dependent kinase 4(Homo sapiens (Human))
Amgen
US Patent
LigandPNGBDBM112465(US8623885, 6)
Affinity DataIC50:  120nMpH: 7.4Assay Description:The CDK4 and CDK1 inhibitory activity of the CDK4/6-FLT3 inhibitors was determined with a filtration kinase assay. The compounds, kinase and substrat...
In DepthDetails US Patent
TargetReceptor-type tyrosine-protein kinase FLT3(Homo sapiens (Human))
Amgen
US Patent
LigandPNGBDBM112465(US8623885, 6)
Affinity DataIC50:  3.30nMpH: 7.6Assay Description:The FLT3 inhibitory activity of the CDK4/6-FLT3 inhibitors was determined with a HTRF kinase assay. The FLT3 enzyme (GST-FLT3 fusion) was purchased f...
In DepthDetails US Patent