BDBM249182 US9457039, 5
SMILES C[C@@]1(N)[C@H](O)[C@@H](CO)O[C@H]1c1ccc2c(N)ncnn12
InChI Key InChIKey=IOPKYPHWAJGEAQ-MWGHHZFTSA-N
Data  1 EC50
  Tab Delimited (TSV)   2D SDfile   Computed 3D by Vconf -m prep SDfile
Find this compound or compounds like it in BindingDB:
Activity Spreadsheet -- Enzyme Inhibition Constant Data from BindingDB
Found 1 hit for monomerid = 249182
TargetGenome polyprotein [2420-3010](Hepatitis C virus genotype 1b (isolate BK) (HCV))
Merck Sharp & Dohme
US Patent
LigandPNGBDBM249182(US9457039, 5)
Affinity DataEC50: >1.00E+5nMT: 2°C. Assay description: To measure cell-based anti-HCV activity of selected compounds of the present invention, replicon cells were seeded at 5000 cells/well in 96-well coll...
Ligand InfoPC cidPC sid
In DepthDetails US Patent