BDBM249187 US9457039, 10
SMILES CO[C@@]1(O[C@H](CO)[C@@H](O)[C@@]1(C)N)c1ccc2c(N)ncnn12
InChI Key InChIKey=NUBDWQSOQDTYBD-PIEOMLNGSA-N
Data  1 EC50
  Tab Delimited (TSV)   2D SDfile   Computed 3D by Vconf -m prep SDfile
Find this compound or compounds like it in BindingDB:
Activity Spreadsheet -- Enzyme Inhibition Constant Data from BindingDB
Found 1 hit for monomerid = 249187
TargetGenome polyprotein [2420-3010](Hepatitis C virus genotype 1b (isolate BK) (HCV))
Merck Sharp & Dohme
US Patent
LigandPNGBDBM249187(US9457039, 10)
Affinity DataEC50: >1.00E+5nMT: 2°C. Assay description: To measure cell-based anti-HCV activity of selected compounds of the present invention, replicon cells were seeded at 5000 cells/well in 96-well coll...
Ligand InfoPC cidPC sid
In DepthDetails US Patent