BDBM249195 US9457039, 20::US9457039, 21
SMILES CC(C)OP1(=O)OC[C@H]2O[C@@H](c3cnn4c(N)ncnc34)[C@](C)(N)[C@@H]2O1
InChI Key InChIKey=BYHZAPYNRPVYGX-ZCKHLOCKSA-N
Data  2 EC50
  Tab Delimited (TSV)   2D SDfile   Computed 3D by Vconf -m prep SDfile
Find this compound or compounds like it in BindingDB:
Activity Spreadsheet -- Enzyme Inhibition Constant Data from BindingDB
Found 2 hits for monomerid = 249195
TargetGenome polyprotein [2420-3010](Hepatitis C virus genotype 1b (isolate BK) (HCV))
Merck Sharp & Dohme
US Patent
LigandPNGBDBM249195(US9457039, 20 | US9457039, 21)
Affinity DataEC50: >1.00E+5nMT: 2°C. Assay description: To measure cell-based anti-HCV activity of selected compounds of the present invention, replicon cells were seeded at 5000 cells/well in 96-well coll...
Ligand InfoPC cidPC sid
In DepthDetails US Patent
TargetGenome polyprotein [2420-3010](Hepatitis C virus genotype 1b (isolate BK) (HCV))
Merck Sharp & Dohme
US Patent
LigandPNGBDBM249195(US9457039, 20 | US9457039, 21)
Affinity DataEC50: >1.00E+5nMT: 2°C. Assay description: To measure cell-based anti-HCV activity of selected compounds of the present invention, replicon cells were seeded at 5000 cells/well in 96-well coll...
Ligand InfoPC cidPC sid
In DepthDetails US Patent