BDBM357653 3-((5-amino- 3H- [1,2,3]triazolo [4,5-b] pyridin- 7- yl)methyl) benzonitrile::US10214527, Example 25
SMILES Nc1cc(Cc2cccc(c2)C#N)c2nn[nH]c2n1
InChI Key InChIKey=WUXAUJNGHXFEJP-UHFFFAOYSA-N
Data  3 IC50
  Tab Delimited (TSV)   2D SDfile   Computed 3D by Vconf -m prep SDfile
Find this compound or compounds like it in BindingDB:
Activity Spreadsheet -- Enzyme Inhibition Constant Data from BindingDB
Found 3 hits for monomerid = 357653
TargetMyeloperoxidase(Homo sapiens (Human))
Bristol-Myers Squibb
US Patent
LigandPNGBDBM357653(3-((5-amino- 3H- [1,2,3]triazolo [4,5-b] pyridin- ...)
Affinity DataIC50:  55nM. Assay description: MPO peroxidation activity was measured in 100 mM KPi (pH 7.4) by utilizing the non-fluorescent reagent Amplex Red (Invitrogen catalog # A12222) which...
Ligand InfoPC cidPC sid
In DepthDetails US Patent
TargetMyeloperoxidase(Homo sapiens (Human))
Bristol-Myers Squibb
US Patent
LigandPNGBDBM357653(3-((5-amino- 3H- [1,2,3]triazolo [4,5-b] pyridin- ...)
Affinity DataIC50:  26nM. Assay description: Inhibition of recombinant human MPO incubated for 10 mins by amplex red dye based assay
Ligand InfoPC cidPC sid
In DepthDetails ArticlePubMed
TargetMyeloperoxidase(Homo sapiens (Human))
Bristol-Myers Squibb
US Patent
LigandPNGBDBM357653(3-((5-amino- 3H- [1,2,3]triazolo [4,5-b] pyridin- ...)
Affinity DataIC50:  17nM. Assay description: Inhibition of recombinant human MPO incubated for 10 mins in presence of 240 mM NaCl and 10 uM H2O2 by aminophenyl fluorescein based assay
Ligand InfoPC cidPC sid
In DepthDetails ArticlePubMed